Reaction Details
TargetMuscarinic acetylcholine receptor M4
LigandBDBM50176065
Substrate/Competitorn/a
Ki 1.69±n/a nM
CommentsPDSP_111
Citation Chelala, JLKilani, AMiller, MJMartin, RJErnsberger, P Muscarinic receptor binding sites of the M4 subtype in porcine lung parenchyma. Pharmacol Toxicol83:200-7 (1998) 
 
Muscarinic acetylcholine receptor M4
Name:Muscarinic acetylcholine receptor M4
Type:Enzyme Catalytic Domain
Mol. Mass.:53079.31
Organism:Homo sapiens (Human)
Description:Cholinergic, muscarinic M4 CHRM4 HUMAN M3::P08173
Residue:479
BDBM50176065
NameBDBM50176065
Synonyms:4-DAMP Acetic acid 4-[(4-acetoxy-phenyl)-pyridin-2-yl-methyl]-phenyl ester CHEMBL76897
TypeSmall organic molecule
Emp. Form.C21H26NO2
Mol. Mass.324.4361
SMILESC[N+]1(C)CCC(CC1)OC(=O)C(c1ccccc1)c1ccccc1