Reaction Details
TargetCapsid scaffolding protein
LigandBDBM50001103
Substrate/Competitorn/a
Meas. Tech.HCMV antiviral assay
EC50 55000±n/a nM
Citation Hostetler, KYBeadle, JR Phosphonate compounds US Patent US10071110 Publication Date 9/11/2018
 
Capsid scaffolding protein
Name:Capsid scaffolding protein
Type:PROTEIN
Mol. Mass.:73854.16
Organism:Human cytomegalovirus (strain AD169) (HHV-5) (Human herpesvirus 5)
Description:ChEMBL_158958
Residue:708
BDBM50001103
NameBDBM50001103
Synonyms:(2-(6-amino-9H-purin-9-yl)ethoxy)methylphosphonic acid 9-(2-(phosphonomethoxy)ethyl)adenine 9-[2-(phosphonomethoxy)ethyl]adenine 9-[3-(Phosphonomethoxy)ethyl]adenine (PMEA) CHEMBL484 US10071110, Compound Adefovir [2-(6-Amino-purin-9-yl)-ethoxymethyl]-phosphonic acid(PMEA) {[2-(6-AMINO-9H-PURIN-9-YL)ETHOXY]METHYL}PHOSPHONIC ACID
TypeSmall organic molecule
Emp. Form.C8H12N5O4P
Mol. Mass.273.1857
SMILESNc1ncnc2n(CCOCP(O)(O)=O)cnc12