Reaction Details
TargetHIV-1 protease
LigandBDBM275769
Substrate/Competitorn/a
Meas. Tech.HSV-1 Antiviral Assay
EC50 30.0±0 nM
Citation Hostetler, KYBeadle, JR Phosphonate compounds US Patent US10071110 Publication Date 9/11/2018
 
HIV-1 protease
Name:HIV-1 protease
Synonyms:n/a
Type:Protein
Mol. Mass.:10794.16
Organism:Human immunodeficiency virus
Description:Q9YQ34
Residue:99
BDBM275769
NameBDBM275769
TypeSmall organic molecule
Emp. Form.C27H50N3O6P
Mol. Mass.543.6762
1(=O)COC(Cn2ccc(N)nc2=O)CO1