Reaction Details
TargetHIV-1 protease
LigandBDBM275785
Substrate/Competitorn/a
Meas. Tech.HSV-1 Antiviral Assay
EC50 2.00±n/a nM
Citation Hostetler, KYBeadle, JR Phosphonate compounds US Patent US10071110 Publication Date 9/11/2018
 
HIV-1 protease
Name:HIV-1 protease
Synonyms:n/a
Type:Protein
Mol. Mass.:10794.16
Organism:Human immunodeficiency virus
Description:Q9YQ34
Residue:99
BDBM275785
NameBDBM275785
Synonyms:US10071110, Compound 1-O-octadecylpropanediol-2-CDV
TypeSmall organic molecule
Emp. Form.C27H52N3O8P
Mol. Mass.577.6908
(CO)OP(O)(=O)COC(CO)Cn1ccc(N)nc1=O