Reaction Details
TargetMelatonin receptor type 1B
LigandBDBM85240
Substrate/Competitorn/a
Ki 24.54±n/a nM
CommentsPDSP_177
Citation Teh, MTSugden, D Comparison of the structure-activity relationships of melatonin receptor agonists and antagonists: lengthening the N-acyl side-chain has differing effects on potency on Xenopus melanophores. Naunyn Schmiedebergs Arch Pharmacol358:522-8 (1998) 
 
Melatonin receptor type 1B
Name:Melatonin receptor type 1B
Type:Enzyme Catalytic Domain
Mol. Mass.:33012.73
Organism:Chick
Description:Melatonin 0 Chick::P51050
Residue:289
BDBM85240
NameBDBM85240
Synonyms:5-MeOT-N-pentanyl
TypeSmall organic molecule
Emp. Form.C19H27N3O2
Mol. Mass.329.4366
SMILESCCCCC(=O)NCCc1ccc2[nH]cc(CCNC(C)=O)c2c1