Reaction Details
TargetMelatonin receptor type 1A
LigandBDBM85385
Substrate/Competitorn/a
Ki 5495.4±n/a nM
CommentsPDSP_1126
Citation Teh, MTSugden, D Comparison of the structure-activity relationships of melatonin receptor agonists and antagonists: lengthening the N-acyl side-chain has differing effects on potency on Xenopus melanophores. Naunyn Schmiedebergs Arch Pharmacol358:522-8 (1998) 
 
Melatonin receptor type 1A
Name:Melatonin receptor type 1A
Type:Enzyme
Mol. Mass.:39392.94
Organism:Homo sapiens (Human)
Description:P48039
Residue:350
BDBM85385
NameBDBM85385
Synonyms:Luzindole,N-hexanoyl
TypeSmall organic molecule
Emp. Form.C23H28N2O
Mol. Mass.348.4812
SMILESCCCCCC(=O)NCCc1c(Cc2ccccc2)[nH]c2ccccc12