Reaction Details
TargetMelatonin receptor type 1B
LigandBDBM85238
Substrate/Competitorn/a
Ki 0.39±n/a nM
CommentsPDSP_175
Citation Teh, MTSugden, D Comparison of the structure-activity relationships of melatonin receptor agonists and antagonists: lengthening the N-acyl side-chain has differing effects on potency on Xenopus melanophores. Naunyn Schmiedebergs Arch Pharmacol358:522-8 (1998) 
 
Melatonin receptor type 1B
Name:Melatonin receptor type 1B
Type:Enzyme
Mol. Mass.:40203.54
Organism:Homo sapiens (Human)
Description:P49286
Residue:362
BDBM85238
NameBDBM85238
Synonyms:5-MeOT-N-butanyl
TypeSmall organic molecule
Emp. Form.C18H25N3O2
Mol. Mass.315.41
SMILESCCCC(=O)NCCc1ccc2[nH]cc(CCNC(C)=O)c2c1