Reaction Details
TargetMelatonin receptor type 1B
LigandBDBM85383
Substrate/Competitorn/a
Ki 323.59±n/a nM
CommentsPDSP_176
Citation Teh, MTSugden, D Comparison of the structure-activity relationships of melatonin receptor agonists and antagonists: lengthening the N-acyl side-chain has differing effects on potency on Xenopus melanophores. Naunyn Schmiedebergs Arch Pharmacol358:522-8 (1998) 
 
Melatonin receptor type 1B
Name:Melatonin receptor type 1B
Type:Enzyme
Mol. Mass.:40203.54
Organism:Homo sapiens (Human)
Description:P49286
Residue:362
BDBM85383
NameBDBM85383
Synonyms:Luzindole,5-MeOT-N-hexanyl
Typen/a
Emp. Form.C24H30N2O2
Mol. Mass.378.5072
SMILESCCCCCC(=O)NCCc1c(Cc2ccccc2)[nH]c2ccc(OC)cc12