Reaction Details
TargetMelatonin receptor type 1B
LigandBDBM85062
Substrate/Competitorn/a
Ki 22.9±n/a nM
CommentsPDSP_1128
Citation Teh, MTSugden, D Comparison of the structure-activity relationships of melatonin receptor agonists and antagonists: lengthening the N-acyl side-chain has differing effects on potency on Xenopus melanophores. Naunyn Schmiedebergs Arch Pharmacol358:522-8 (1998) 
 
Melatonin receptor type 1B
Name:Melatonin receptor type 1B
Type:Enzyme
Mol. Mass.:40203.54
Organism:Homo sapiens (Human)
Description:P49286
Residue:362
BDBM85062
NameBDBM85062
Synonyms:Luzindole,N-propanoyl N-0889 | N-[2-(2-Benzyl-1H-indol-3-yl)ethyl]propionamide
TypeSmall organic molecule
Emp. Form.C20H22N2O
Mol. Mass.306.4015
SMILESCCC(=O)NCCc1c(Cc2ccccc2)[nH]c2ccccc12