Reaction Details
TargetVasopressin V1b receptor
LigandBDBM35667
Substrate/Competitorn/a
Ki 0.59±n/a nM
CommentsPDSP_336
Citation Yamamura, YNakamura, SItoh, SHirano, TOnogawa, TYamashita, TYamada, YTsujimae, KAoyama, MKotosai, KOgawa, HYamashita, HKondo, KTominaga, MTsujimoto, GMori, T OPC-41061, a highly potent human vasopressin V2-receptor antagonist: pharmacological profile and aquaretic effect by single and multiple oral dosing in rats. J Pharmacol Exp Ther287:860-7 (1998) Vasopressin V1b receptor
Name:Vasopressin V1b receptor
Type:Enzyme
Mol. Mass.:46985.01
Organism:Homo sapiens (Human)
Description:P47901
Residue:424
BDBM35667
NameBDBM35667
Synonyms:AVP US10131692, 44 (AVP) [3H]Argipressin tannate | [3H]vasopressin
Typeradiolabeled ligand
Emp. Form.C46H65N15O12S2
Mol. Mass.1084.232
SMILES[#7]-[#6@H]-1-[#6]-[#16]-[#16]-[#6]-[#6@H](-[#7]-[#6](=O)-[#6@H](-[#6]-[#6](-[#7])=O)-[#7]-[#6](=O)-[#6@H](-[#6]-[#6]-[#6](-[#7])=O)-[#7]-[#6](=O)-[#6@H](-[#6]-c2ccccc2)-[#7]-[#6](=O)-[#6@H](-[#6]-c2ccc(-[#8])cc2)-[#7]-[#6]-1=O)-[#6](=O)-[#7]-1-[#6]-[#6]-[#6]-[#6@H]-1-[#6](=O)-[#7]-[#6@@H](-[#6]-[#6]-[#6]\[#7]=[#6](\[#7])-[#7])-[#6](=O)-[#7]-[#6]-[#6](-[#7])=O