Reaction Details
TargetGalanin receptor type 1
LigandBDBM85073
Substrate/Competitorn/a
Ki 0.25±n/a nM
CommentsPDSP_3166
Citation Borowsky, BWalker, MWHuang, LYJones, KASmith, KEBard, JBranchek, TAGerald, C Cloning and characterization of the human galanin GALR2 receptor. Peptides19:1771-81 (1998) 
 
Galanin receptor type 1
Name:Galanin receptor type 1
Type:Enzyme Catalytic Domain
Mol. Mass.:38976.60
Organism:Homo sapiens (Human)
Description:Galanin R1 GALR1 HUMAN::P47211
Residue:349
BDBM85073
NameBDBM85073
Synonyms:CAS_3043476 NSC_3043476
TypeSmall organic molecule
Emp. Form.C23H30N2O3
Mol. Mass.382.4959
SMILESCOc1ccccc1N(CCOc1ccc(C)cc1)C(=O)CN1CCCCC1