Reaction Details
TargetMuscarinic acetylcholine receptor M1
LigandBDBM50003359
Substrate/Competitorn/a
Ki 79.43±n/a nM
CommentsPDSP_3206
Citation Watson, JBrough, SColdwell, MCGager, THo, MHunter, AJJerman, JMiddlemiss, DNRiley, GJBrown, AM Functional effects of the muscarinic receptor agonist, xanomeline, at 5-HT1 and 5-HT2 receptors. Br J Pharmacol125:1413-20 (1998) 
 
Muscarinic acetylcholine receptor M1
Name:Muscarinic acetylcholine receptor M1
Type:Protein
Mol. Mass.:51442.54
Organism:Homo sapiens (Human)
Description:P11229
Residue:460
BDBM50003359
NameBDBM50003359
Synonyms:5-(4-Hexyloxy-[1,2,5]thiadiazol-3-yl)-1-methyl-1,2,3,6-tetrahydro-pyridine; oxalic acid CHEMBL21536 LY 246708 | Xanomeline
TypeSmall organic molecule
Emp. Form.C14H23N3OS
Mol. Mass.281.417
SMILESCCCCCCOc1nsnc1C1=CCCN(C)C1