Reaction Details
Target5-hydroxytryptamine receptor 2A
LigandBDBM50014999
Substrate/Competitorn/a
Ki 0.4±n/a nM
CommentsPDSP_712
Citation Nelson, DLLucaites, VLWainscott, DBGlennon, RA Comparisons of hallucinogenic phenylisopropylamine binding affinities at cloned human 5-HT2A, -HT(2B) and 5-HT2C receptors. Naunyn Schmiedebergs Arch Pharmacol359:1-6 (1999) 
 
5-hydroxytryptamine receptor 2A
Name:5-hydroxytryptamine receptor 2A
Type:undefined
Mol. Mass.:52607.65
Organism:Homo sapiens (Human)
Description:P28223
Residue:471
BDBM50014999
NameBDBM50014999
Synonyms:CHEMBL274589 | DOBz
TypeSmall organic molecule
Emp. Form.C18H23NO2
Mol. Mass.285.3807
SMILESCOc1cc(Cc2ccccc2)c(OC)cc1CC(C)N