Reaction Details
TargetSigma non-opioid intracellular receptor 1
LigandBDBM85392
Substrate/Competitorn/a
Ki 7.3±n/a nM
CommentsPDSP_1519
Citation Ganapathy, MEPrasad, PDHuang, WSeth, PLeibach, FHGanapathy, V Molecular and ligand-binding characterization of the sigma-receptor in the Jurkat human T lymphocyte cell line. J Pharmacol Exp Ther289:251-60 (1999) Sigma non-opioid intracellular receptor 1
Name:Sigma non-opioid intracellular receptor 1
Type:Enzyme Catalytic Domain
Mol. Mass.:25124.85
Organism:Homo sapiens (Human)
Description:Q99720
Residue:223
BDBM85392
NameBDBM85392
Synonyms:CAS_131443 PPAP, (-)
TypeSmall organic molecule
Emp. Form.C18H23N
Mol. Mass.253.3819
SMILESCC(Cc1ccccc1)NCCCc1ccccc1