Reaction Details
TargetSodium channel protein type 9 subunit alpha
LigandBDBM275877
Substrate/Competitorn/a
Meas. Tech.Binding Assay
pH7.4±n/a
Temperature298.15±n/a K
IC50 0.300±n/a nM
Commentsextracted
Citation Dehnhardt, CMChowdhury, SFocken, TGrimwood, MEHemeon, IWSafina, BSutherlin, DP N-substituted benzamides and methods of use thereof US Patent US10071957 Publication Date 9/11/2018
 
Sodium channel protein type 9 subunit alpha
Name:Sodium channel protein type 9 subunit alpha
Type:Protein
Mol. Mass.:226375.97
Organism:Homo sapiens (Human)
Description:Q15858
Residue:1988
BDBM275877
NameBDBM275877
Synonyms:US10071957, Example 96
TypeSmall organic molecule
Emp. Form.C20H19Cl2FN2O4S
Mol. Mass.473.345
SMILESFc1cc(COc2cc(Cl)cc(Cl)c2)c(cc1C(=O)NS(=O)(=O)N1CCC1)C1CC1