Reaction Details
TargetKappa-type opioid receptor
LigandBDBM85395
Substrate/Competitorn/a
Ki 14±n/a nM
CommentsPDSP_1166
Citation McLaughlin, JPHill, KPJiang, QSebastian, AArcher, SBidlack, JM Nitrocinnamoyl and chlorocinnamoyl derivatives of dihydrocodeinone: in vivo and in vitro characterization of mu-selective agonist and antagonist activity. J Pharmacol Exp Ther289:304-11 (1999) Kappa-type opioid receptor
Name:Kappa-type opioid receptor
Type:Enzyme Catalytic Domain
Mol. Mass.:42629.84
Organism:CALF
Description:Q2KIP6
Residue:380
BDBM85395
NameBDBM85395
Synonyms:MC-CAM
TypeSmall organic molecule
Emp. Form.C30H31ClN2O4
Mol. Mass.519.031
SMILESCOc1ccc2CC3N(CC4CC4)CCC45[C@@H](Oc1c24)C(=O)CCC35NC(=O)\C=C/c1ccc(Cl)cc1