Reaction Details
TargetMu-type opioid receptor
LigandBDBM85394
Substrate/Competitorn/a
Ki 1.1±n/a nM
CommentsPDSP_1297
Citation McLaughlin, JPHill, KPJiang, QSebastian, AArcher, SBidlack, JM Nitrocinnamoyl and chlorocinnamoyl derivatives of dihydrocodeinone: in vivo and in vitro characterization of mu-selective agonist and antagonist activity. J Pharmacol Exp Ther289:304-11 (1999) Mu-type opioid receptor
Name:Mu-type opioid receptor
Type:Enzyme Catalytic Domain
Mol. Mass.:45038.37
Organism:CALF
Description:OPIATE Mu 2 0 CALF::P79350
Residue:401
BDBM85394
NameBDBM85394
Synonyms:N-CPM-CACO
TypeSmall organic molecule
Emp. Form.C30H31N3O6
Mol. Mass.529.5836
SMILESCOc1ccc2CC3N(CC4CC4)CCC45[C@@H](Oc1c24)C(=O)CCC35NC(=O)\C=C/c1ccc(cc1)[N+]([O-])=O