Reaction Details
TargetCorticotropin-releasing factor receptor 2
LigandBDBM50058163
Substrate/Competitorn/a
Ki>10000±n/a nM
CommentsPDSP_570
Citation Okuyama, SChaki, SKawashima, NSuzuki, YOgawa, SNakazato, AKumagai, TOkubo, TTomisawa, K Receptor binding, behavioral, and electrophysiological profiles of nonpeptide corticotropin-releasing factor subtype 1 receptor antagonists CRA1000 and CRA1001. J Pharmacol Exp Ther289:926-35 (1999) Corticotropin-releasing factor receptor 2
Name:Corticotropin-releasing factor receptor 2
Type:Enzyme Catalytic Domain
Mol. Mass.:47697.09
Organism:RAT
Description:CRF2 Beta 0 RAT::P47866
Residue:411
BDBM50058163
NameBDBM50058163
Synonyms:Butyl-[2,5-dimethyl-7-(2,4,6-trimethyl-phenyl)-7H-pyrrolo[2,3-d]pyrimidin-4-yl]-ethyl-amine CP 154,526 N-butyl-N-ethyl-7-mesityl-2,5-dimethyl-7H-pyrrolo[2,3-d]pyrimidin-4-amine
TypeSmall organic molecule
Emp. Form.C23H32N4
Mol. Mass.364.527
SMILESCCCCN(CC)c1nc(C)nc2n(cc(C)c12)-c1c(C)cc(C)cc1C