Reaction Details
Target5-hydroxytryptamine receptor 2C
LigandBDBM82479
Substrate/Competitorn/a
Ki 29±n/a nM
CommentsPDSP_1408
Citation Bymaster, FPNelson, DLDeLapp, NWFalcone, JFEckols, KTruex, LLForeman, MMLucaites, VLCalligaro, DO Antagonism by olanzapine of dopamine D1, serotonin2, muscarinic, histamine H1 and alpha 1-adrenergic receptors in vitro. Schizophr Res37:107-22 (1999) 
 
5-hydroxytryptamine receptor 2C
Name:5-hydroxytryptamine receptor 2C
Type:G Protein-Coupled Receptor (GPCR)
Mol. Mass.:51836.79
Organism:Homo sapiens (Human)
Description:P28335
Residue:458
BDBM82479
NameBDBM82479
Synonyms:CAS_132539-06-1 OLANZAPINE | USRE49340, Rank 2
TypeSmall organic molecule
Emp. Form.C17H20N4S
Mol. Mass.312.432
SMILESCN1CCN(CC1)C1=c2cc(C)sc2=Nc2ccccc2N1