Reaction Details
TargetD(3) dopamine receptor
LigandBDBM85413
Substrate/Competitorn/a
Ki 4.5±n/a nM
CommentsPDSP_683
Citation Lawler, CPPrioleau, CLewis, MMMak, CJiang, DSchetz, JAGonzalez, AMSibley, DRMailman, RB Interactions of the novel antipsychotic aripiprazole (OPC-14597) with dopamine and serotonin receptor subtypes. Neuropsychopharmacology20:612-27 (1999) 
 
D(3) dopamine receptor
Name:D(3) dopamine receptor
Type:Protein
Mol. Mass.:49540.58
Organism:Rattus norvegicus (Rat)
Description:P19020
Residue:446
BDBM85413
NameBDBM85413
Synonyms:7-{4-[4-(4-hydroxy-2,3-dimethylphenyl)piperazin-1-yl]butoxy}-1,2,3,4-tetrahydroquinolin-2-one | DM 1451
TypeSmall organic molecule
Emp. Form.C25H33N3O3
Mol. Mass.423.5478
SMILESCc1c(O)ccc(N2CCN(CCCCOc3ccc4CCC(=O)Nc4c3)CC2)c1C