Reaction Details
TargetHexokinase-1
LigandBDBM85420
Substrate/Competitorn/a
Meas. Tech.Enzyme Inhibition Assay
pH7.6±0
Temperature298.15±0 K
IC50 7000000±0.0 nM
Citation Willson, MAlric, IPerie, JSanejouand, YH Yeast hexokinase inhibitors designed from the 3-D enzyme structure rebuilding. J Enzym Inhib12:101-21 (1997) 
 
Hexokinase-1
Name:Hexokinase-1
Type:Protein
Mol. Mass.:53728.20
Organism:Saccharomyces cerevisiae
Description:P04806
Residue:485
BDBM85420
NameBDBM85420
Synonyms:Glucosamine analog, 1
TypeSmall organic molecule
Emp. Form.C13H17NO6
Mol. Mass.283.2772
SMILESOCC1OC(O)C(NC(=O)c2ccccc2)C(O)C1O