Reaction Details
TargetHexokinase-1
LigandBDBM85424
Substrate/Competitorn/a
Meas. Tech.Enzyme Inhibition Assay
pH7.6±0
Temperature298.15±0 K
IC50 6000000±0.0 nM
Citation Willson, MAlric, IPerie, JSanejouand, YH Yeast hexokinase inhibitors designed from the 3-D enzyme structure rebuilding. J Enzym Inhib12:101-21 (1997) 
 
Hexokinase-1
Name:Hexokinase-1
Type:Protein
Mol. Mass.:53728.20
Organism:Saccharomyces cerevisiae
Description:P04806
Residue:485
BDBM85424
NameBDBM85424
Synonyms:Glucosamine analog, 8
TypeSmall organic molecule
Emp. Form.C13H16N2O8
Mol. Mass.328.2747
SMILESOCC1OC(O)C(NC(=O)c2cccc(c2)N(=O)=O)C(O)C1O