Reaction Details
TargetHexokinase-1
LigandBDBM85425
Substrate/Competitorn/a
Meas. Tech.Enzyme Inhibition Assay
pH7.6±0
Temperature298.15±0 K
IC50 1000000±0.0 nM
Citation Willson, MAlric, IPerie, JSanejouand, YH Yeast hexokinase inhibitors designed from the 3-D enzyme structure rebuilding. J Enzym Inhib12:101-21 (1997) 
 
Hexokinase-1
Name:Hexokinase-1
Type:Protein
Mol. Mass.:53728.20
Organism:Saccharomyces cerevisiae
Description:P04806
Residue:485
BDBM85425
NameBDBM85425
Synonyms:Glucosamine analog, 9
TypeSmall organic molecule
Emp. Form.C13H18N2O6
Mol. Mass.298.2918
SMILESNc1ccccc1C(=O)NC1C(O)OC(CO)C(O)C1O