Reaction Details
TargetNeprilysin
LigandBDBM85429
Substrate/Competitorn/a
Meas. Tech.Enzyme Inhibition Assay
Temperature298.15±0 K
IC50 3±0.0 nM
Citation Norcini, GMorazzoni, GPocchiari, FSantangelo, FSemeraro, C Novel selective thiol inhibitors of neutral endopeptidase containing heterocycles at P'2 position. J Enzym Inhib12:155-60 (1997) 
 
Neprilysin
Name:Neprilysin
Type:Protein
Mol. Mass.:85789.59
Organism:Rattus norvegicus (Rat)
Description:P07861
Residue:750
BDBM85429
NameBDBM85429
Synonyms:NEP inhibitor, 6i
TypeSmall organic molecule
Emp. Form.C16H16N2O3S
Mol. Mass.316.375
SMILESOC(=O)c1ccnc(NC(=O)C(CS)Cc2ccccc2)c1