Reaction Details
TargetS-adenosylmethionine synthase isoform type-2
LigandBDBM85447
Substrate/Competitorn/a
Meas. Tech.Inhibition Assay
pH7.5±0
Temperature310.15±0 K
Ki 7000±0.0 nM
IC50 50000±0.0 nM
Citation Lavrador, KAllart, BGuillerm, DGuillerm, G A new series of S-adenosyl-L-methionine synthetase inhibitors. J Enzym Inhib13:361-7 (1998) 
 
S-adenosylmethionine synthase isoform type-2
Name:S-adenosylmethionine synthase isoform type-2
Type:PROTEIN
Mol. Mass.:43713.68
Organism:Rattus norvegicus
Description:ChEMBL_105118
Residue:395
BDBM85447
NameBDBM85447
Synonyms:Epoxy analogue, I(a)
TypeSmall organic molecule
Emp. Form.C5H9NO3
Mol. Mass.131.1299
SMILESN[C@@H](C[C@H]1CO1)C(O)=O