Reaction Details
TargetNorepinephrine transporter
LigandBDBM35229
Substrate/Competitorn/a
Ki 0.551±n/a nM
CommentsPDSP_638
Citation Béïque, JCde Montigny, CBlier, PDebonnel, G Venlafaxine: discrepancy between in vivo 5-HT and NE reuptake blockade and affinity for reuptake sites. Synapse32:198-211 (1999) 
 
Norepinephrine transporter
Name:Norepinephrine transporter
Synonyms:n/a
Type:Enzyme Catalytic Domain
Mol. Mass.:2082.45
Organism:RAT
Description:Norepinephrine transporter 0 RAT::Q9JIA2
Residue:19
MLLARMKPQVQPELGGADQ
BDBM35229
NameBDBM35229
TypeSmall organic molecule
Emp. Form.C18H22N2
Mol. Mass.266.3807
SMILESCNCCCN1c2ccccc2CCc2ccccc12