Reaction Details
TargetHistamine H3 receptor
LigandBDBM22530
Substrate/Competitorn/a
Ki>10000±n/a nM
CommentsPDSP_1343
Citation Lovenberg, TWRoland, BLWilson, SJJiang, XPyati, JHuvar, AJackson, MRErlander, MG Cloning and functional expression of the human histamine H3 receptor. Mol Pharmacol55:1101-7 (1999) Histamine H3 receptor
Name:Histamine H3 receptor
Type:G Protein-Coupled Receptor (GPCR)
Mol. Mass.:48691.47
Organism:Homo sapiens (Human)
Description:Binding assays were using CHO cells stably expressing hH3R receptors.
Residue:445
BDBM22530
NameBDBM22530
Synonyms:N(alpha)-Methylhistamine N-methylhistamine [2-(1H-imidazol-5-yl)ethyl](methyl)amine | [3H]N-alpha-methyl histamine
Typeradiolabeled ligand
Emp. Form.C6H11N3
Mol. Mass.125.1716
SMILESCNCCc1cnc[nH]1