Reaction Details
TargetBombesin receptor subtype-3
LigandBDBM85493
Substrate/Competitorn/a
Ki 5300±n/a nM
CommentsPDSP_762
Citation Katsuno, TPradhan, TKRyan, RRMantey, SAHou, WDonohue, PJAkeson, MASpindel, ERBattey, JFCoy, DHJensen, RT Pharmacology and cell biology of the bombesin receptor subtype 4 (BB4-R). Biochemistry38:7307-20 (1999) 
 
Bombesin receptor subtype-3
Name:Bombesin receptor subtype-3
Type:Enzyme Catalytic Domain
Mol. Mass.:44424.45
Organism:Homo sapiens (Human)
Description:Bombesin 3 BRS3 HUMAN::P32247
Residue:399
BDBM85493
NameBDBM85493
Synonyms:DTyr6,DAla11-Bn(6-13)butylamide
TypeSmall organic molecule
Emp. Form.C52H75N13O10
Mol. Mass.1042.233
SMILESCCCCNC(=O)[C@H](CC(C)C)NC(=O)[C@H](Cc1cnc[nH]1)NC(=O)[C@@H](C)NC(=O)[C@@H](NC(=O)[C@H](C)NC(=O)[C@H](Cc1c[nH]c2ccccc12)NC(=O)[C@H](CCC(N)=O)NC(=O)[C@H](N)Cc1ccc(O)cc1)C(C)C