Reaction Details
TargetBombesin receptor subtype-3
LigandBDBM85506
Substrate/Competitorn/a
Ki 3100±n/a nM
CommentsPDSP_1596
Citation Katsuno, TPradhan, TKRyan, RRMantey, SAHou, WDonohue, PJAkeson, MASpindel, ERBattey, JFCoy, DHJensen, RT Pharmacology and cell biology of the bombesin receptor subtype 4 (BB4-R). Biochemistry38:7307-20 (1999) 
 
Bombesin receptor subtype-3
Name:Bombesin receptor subtype-3
Type:Enzyme Catalytic Domain
Mol. Mass.:44424.45
Organism:Homo sapiens (Human)
Description:Bombesin 3 BRS3 HUMAN::P32247
Residue:399
BDBM85506
NameBDBM85506
Synonyms:CAS_125988 Rhodei-Litorin
TypeSmall organic molecule
Emp. Form.C51H69N13O11S
Mol. Mass.1072.239
SMILESCCC(C)C(NC(=O)C1CCC(=O)N1)C(=O)NC(Cc1c[nH]c2ccccc12)C(=O)NC(C)C(=O)NC(C(C)O)C(=O)NCC(=O)NC(Cc1cnc[nH]1)C(=O)NC(Cc1ccccc1)C(=O)NC(CCSC)C(N)=O