Reaction Details
TargetBombesin receptor subtype-3
LigandBDBM85504
Substrate/Competitorn/a
Ki>10000±n/a nM
CommentsPDSP_1777
Citation Katsuno, TPradhan, TKRyan, RRMantey, SAHou, WDonohue, PJAkeson, MASpindel, ERBattey, JFCoy, DHJensen, RT Pharmacology and cell biology of the bombesin receptor subtype 4 (BB4-R). Biochemistry38:7307-20 (1999) 
 
Bombesin receptor subtype-3
Name:Bombesin receptor subtype-3
Type:Enzyme Catalytic Domain
Mol. Mass.:44424.45
Organism:Homo sapiens (Human)
Description:Bombesin 3 BRS3 HUMAN::P32247
Residue:399
BDBM85504
NameBDBM85504
Synonyms:Substance P,[DArg1,DTrp7,9,Leu11]
TypeSmall organic molecule
Emp. Form.C72H101N17O13
Mol. Mass.1412.6784
SMILESCC(C)C[C@H](NC(=O)[C@H](CC(C)C)NC(=O)[C@H](Cc1c[nH]c2ccccc12)NC(=O)[C@H](Cc1ccccc1)NC(=O)[C@@H](Cc1c[nH]c2ccccc12)NC(=O)[C@H](CCC(N)=O)NC(=O)[C@H](CCC(N)=O)NC(=O)[C@@H]1CCCN1C(=O)[C@H](CCCCN)NC(=O)[C@@H]1CCCN1C(=O)[C@@H](C)N)C(N)=O