Reaction Details
TargetBombesin
LigandBDBM85494
Substrate/Competitorn/a
Ki 974±n/a nM
CommentsPDSP_751
Citation Katsuno, TPradhan, TKRyan, RRMantey, SAHou, WDonohue, PJAkeson, MASpindel, ERBattey, JFCoy, DHJensen, RT Pharmacology and cell biology of the bombesin receptor subtype 4 (BB4-R). Biochemistry38:7307-20 (1999) 
 
Bombesin
Name:Bombesin
Type:Enzyme Catalytic Domain
Mol. Mass.:12340.04
Organism:Frog
Description:Bombesin 4 0 Frog::P84213
Residue:107
BDBM85494
NameBDBM85494
Synonyms:DPhe6-Bn(6-13)NH2
TypeSmall organic molecule
Emp. Form.C47H65N13O9
Mol. Mass.956.1007
SMILESCC(C)C[C@H](NC(=O)[C@H](Cc1cnc[nH]1)NC(=O)CNC(=O)[C@@H](NC(=O)[C@H](C)NC(=O)[C@H](Cc1c[nH]c2ccccc12)NC(=O)[C@H](CCC(N)=O)NC(=O)[C@H](N)Cc1ccccc1)C(C)C)C(N)=O