Reaction Details
TargetBombesin
LigandBDBM85492
Substrate/Competitorn/a
Ki 128±n/a nM
CommentsPDSP_894
Citation Katsuno, TPradhan, TKRyan, RRMantey, SAHou, WDonohue, PJAkeson, MASpindel, ERBattey, JFCoy, DHJensen, RT Pharmacology and cell biology of the bombesin receptor subtype 4 (BB4-R). Biochemistry38:7307-20 (1999) 
 
Bombesin
Name:Bombesin
Type:Enzyme Catalytic Domain
Mol. Mass.:12340.04
Organism:Frog
Description:Bombesin 4 0 Frog::P84213
Residue:107
BDBM85492
NameBDBM85492
Synonyms:GRP-10,frog
TypeSmall organic molecule
Emp. Form.C50H73N17O11S
Mol. Mass.1120.287
SMILESCSCC[C@H](NC(=O)[C@H](CC(C)C)NC(=O)[C@H](Cc1cnc[nH]1)NC(=O)CNC(=O)[C@@H](NC(=O)[C@H](C)NC(=O)[C@H](Cc1c[nH]c2ccccc12)NC(=O)[C@H](Cc1cnc[nH]1)NC(=O)[C@H](CC(N)=O)NC(=O)CN)C(C)C)C(N)=O