Reaction Details
TargetBombesin
LigandBDBM85498
Substrate/Competitorn/a
Ki 1.2±n/a nM
CommentsPDSP_1082
Citation Katsuno, TPradhan, TKRyan, RRMantey, SAHou, WDonohue, PJAkeson, MASpindel, ERBattey, JFCoy, DHJensen, RT Pharmacology and cell biology of the bombesin receptor subtype 4 (BB4-R). Biochemistry38:7307-20 (1999) 
 
Bombesin
Name:Bombesin
Type:Enzyme Catalytic Domain
Mol. Mass.:12340.04
Organism:Frog
Description:Bombesin 4 0 Frog::P84213
Residue:107
BDBM85498
NameBDBM85498
Synonyms:CAS_5486808 NSC_5486808
TypeSmall organic molecule
Emp. Form.C51H68N14O11S
Mol. Mass.1085.238
SMILESCSCCC(NC(=O)C(Cc1ccccc1)NC(=O)C(Cc1cnc[nH]1)NC(=O)CNC(=O)C(NC(=O)C(C)NC(=O)C(Cc1c[nH]c2ccccc12)NC(=O)C(CCC(N)=O)NC(=O)C1CCC(=O)N1)C(C)C)C(N)=O