Reaction Details
TargetEnoyl-[acyl-carrier-protein] reductase [NADPH] FabI
LigandBDBM36539
Substrate/Competitorn/a
Meas. Tech.Jump dilution assay
pH7.5±n/a
Temperature298.15±n/a K
Ki 0.100±n/a nM
Commentsextracted
Citation Tonge, PPan, P Pyridone FabI inhibitors and uses thereof US Patent US10071965 Publication Date 9/11/2018
 
Enoyl-[acyl-carrier-protein] reductase [NADPH] FabI
Name:Enoyl-[acyl-carrier-protein] reductase [NADPH] FabI
Type:Enzyme
Mol. Mass.:27989.00
Organism:Staphylococcus aureus
Description:Q6GI75
Residue:256
BDBM36539
NameBDBM36539
Synonyms:5-chloro-2-phenoxylphenol US10071965, Compound PT52
TypeSmall organic molecule
Emp. Form.C12H9ClO2
Mol. Mass.220.652
SMILESOc1cc(Cl)ccc1Oc1ccccc1