Reaction Details
TargetProstaglandin G/H synthase 1
LigandBDBM50016799
Substrate/Competitorn/a
Ki>10000±n/a nM
CommentsPDSP_4451
Citation Warner, TDGiuliano, FVojnovic, IBukasa, AMitchell, JAVane, JR Nonsteroid drug selectivities for cyclo-oxygenase-1 rather than cyclo-oxygenase-2 are associated with human gastrointestinal toxicity: a full in vitro analysis. Proc Natl Acad Sci U S A96:7563-8 (1999) 
 
Prostaglandin G/H synthase 1
Name:Prostaglandin G/H synthase 1
Type:Enzyme
Mol. Mass.:68692.62
Organism:Homo sapiens (Human)
Description:P23219
Residue:599
BDBM50016799
NameBDBM50016799
Synonyms:(1,8-Diethyl-1,3,4,9-tetrahydro-pyrano[3,4-b]indol-1-yl)-acetic acid AY-24236 ETODOLAC Lodine | Lodine xl
TypeSmall organic molecule
Emp. Form.C17H21NO3
Mol. Mass.287.3535
SMILESCCc1cccc2c3CCOC(CC)(CC(O)=O)c3[nH]c12