Reaction Details
TargetProstaglandin G/H synthase 1
LigandBDBM85511
Substrate/Competitorn/a
Ki 0.19±n/a nM
CommentsPDSP_3994
Citation Warner, TDGiuliano, FVojnovic, IBukasa, AMitchell, JAVane, JR Nonsteroid drug selectivities for cyclo-oxygenase-1 rather than cyclo-oxygenase-2 are associated with human gastrointestinal toxicity: a full in vitro analysis. Proc Natl Acad Sci U S A96:7563-8 (1999) 
 
Prostaglandin G/H synthase 1
Name:Prostaglandin G/H synthase 1
Type:Enzyme
Mol. Mass.:68692.62
Organism:Homo sapiens (Human)
Description:P23219
Residue:599
BDBM85511
NameBDBM85511
Synonyms:CAS_74103-07-4 Ketorolac tris salt | Toradol
TypeSmall organic molecule
Emp. Form.C15H13NO3
Mol. Mass.255.2686
SMILESOC(=O)C1CCn2c1ccc2C(=O)c1ccccc1