Reaction Details
TargetProstaglandin G/H synthase 2
LigandBDBM85243
Substrate/Competitorn/a
Ki 2300±n/a nM
CommentsPDSP_3986
Citation Warner, TDGiuliano, FVojnovic, IBukasa, AMitchell, JAVane, JR Nonsteroid drug selectivities for cyclo-oxygenase-1 rather than cyclo-oxygenase-2 are associated with human gastrointestinal toxicity: a full in vitro analysis. Proc Natl Acad Sci U S A96:7563-8 (1999) 
 
Prostaglandin G/H synthase 2
Name:Prostaglandin G/H synthase 2
Type:Enzyme
Mol. Mass.:69003.89
Organism:Homo sapiens (Human)
Description:Recombinant Cox-2 provided by Cayman (Cayman Chemical Co.,Ann Arbor, MI).
Residue:604
BDBM85243
NameBDBM85243
Synonyms:2-VALERYLOXYBENZOIC ACID valeryl salicylate
TypeSmall organic molecule
Emp. Form.C12H14O4
Mol. Mass.222.2372
SMILESCCCCC(=O)Oc1ccccc1C(O)=O