Reaction Details
Target5-hydroxytryptamine receptor 2A
LigandBDBM82071
Substrate/Competitorn/a
Ki>10000±n/a nM
CommentsPDSP_1947
Citation Sánchez, CHyttel, J Comparison of the effects of antidepressants and their metabolites on reuptake of biogenic amines and on receptor binding. Cell Mol Neurobiol19:467-89 (1999) 
 
5-hydroxytryptamine receptor 2A
Name:5-hydroxytryptamine receptor 2A
Type:G Protein-Coupled Receptor (GPCR)
Mol. Mass.:52852.05
Organism:Rattus norvegicus (rat)
Description:Rat cortex membranes 5-HT2A receptors.
Residue:471
BDBM82071
NameBDBM82071
Synonyms:CAS_93413-69-5 NSC_62923 Venlafaxine hydrochloride WY-45655
TypeSmall organic molecule
Emp. Form.C17H27NO2
Mol. Mass.277.4018
SMILESCOc1ccc(cc1)C(CN(C)C)C1(O)CCCCC1