Reaction Details
TargetAlpha-2C adrenergic receptor
LigandBDBM50048392
Substrate/Competitorn/a
Ki>10000±n/a nM
CommentsPDSP_444
Citation Sánchez, CHyttel, J Comparison of the effects of antidepressants and their metabolites on reuptake of biogenic amines and on receptor binding. Cell Mol Neurobiol19:467-89 (1999) 
 
Alpha-2C adrenergic receptor
Name:Alpha-2C adrenergic receptor
Type:Enzyme Catalytic Domain
Mol. Mass.:49890.50
Organism:RAT
Description:adrenergic Alpha2 0 RAT::P22086
Residue:458
BDBM50048392
NameBDBM50048392
Synonyms:2-(tert-butylamino)-1-(3-chlorophenyl)propan-1-one BUPROPION HYDROCHLORIDE US9944618, Compound ID No. 176
TypeSmall organic molecule
Emp. Form.C13H18ClNO
Mol. Mass.239.741
SMILESCC(NC(C)(C)C)C(=O)c1cccc(Cl)c1