Reaction Details
TargetProstaglandin G/H synthase 2
LigandBDBM17638
Substrate/Competitorn/a
Ki 400±n/a nM
CommentsPDSP_4449
Citation Chan, CCBoyce, SBrideau, CCharleson, SCromlish, WEthier, DEvans, JFord-Hutchinson, AWForrest, MJGauthier, JYGordon, RGresser, MGuay, JKargman, SKennedy, BLeblanc, YLeger, SMancini, JO'Neill, GPOuellet, MPatrick, DPercival, MDPerrier, HPrasit, PRodger, I Rofecoxib [Vioxx, MK-0966; 4-(4'-methylsulfonylphenyl)-3-phenyl-2-(5H)-furanone]: a potent and orally active cyclooxygenase-2 inhibitor. Pharmacological and biochemical profiles. J Pharmacol Exp Ther290:551-60 (1999) Prostaglandin G/H synthase 2
Name:Prostaglandin G/H synthase 2
Type:Enzyme
Mol. Mass.:69003.89
Organism:Homo sapiens (Human)
Description:Recombinant Cox-2 provided by Cayman (Cayman Chemical Co.,Ann Arbor, MI).
Residue:604
BDBM17638
NameBDBM17638
Synonyms:2-{1-[(4-chlorophenyl)carbonyl]-5-methoxy-2-methyl-1H-indol-3-yl}acetic acid Indocin US11478464, Compound Indomethacin US9271961, Indomethacin | indometacin
TypeSmall organic molecule
Emp. Form.C19H16ClNO4
Mol. Mass.357.788
SMILESCOc1ccc2n(C(=O)c3ccc(Cl)cc3)c(C)c(CC(O)=O)c2c1