Reaction Details
TargetSomatostatin receptor type 1
LigandBDBM50063839
Substrate/Competitorn/a
Ki 18.4±n/a nM
CommentsPDSP_3365
Citation Patel, YC Somatostatin and its receptor family. Front Neuroendocrinol20:157-98 (1999) 
 
Somatostatin receptor type 1
Name:Somatostatin receptor type 1
Type:Enzyme
Mol. Mass.:42692.81
Organism:Homo sapiens (Human)
Description:P30872
Residue:391
BDBM50063839
NameBDBM50063839
Synonyms:BIM 23268 H-cyclo[DCys-Phe-Phe-DTrp-Lys-Thr-Phe-DCys]-NH2
TypeSmall organic molecule
Emp. Form.C54H67N11O9S2
Mol. Mass.1078.308
SMILESCC(O)[C@H]1NC(=O)[C@H](CCCCN)NC(=O)[C@H](Cc2c[nH]c3ccccc23)NC(=O)[C@H](Cc2ccccc2)NC(=O)[C@@H](Cc2ccccc2)NC(=O)[C@H](N)CSSC[C@@H](NC(=O)[C@H](Cc2ccccc2)NC1=O)C(N)=O