Reaction Details
TargetSomatostatin receptor type 2
LigandBDBM50059090
Substrate/Competitorn/a
Ki 0.4±n/a nM
CommentsPDSP_1405
Citation Patel, YC Somatostatin and its receptor family. Front Neuroendocrinol20:157-98 (1999) 
 
Somatostatin receptor type 2
Name:Somatostatin receptor type 2
Type:Enzyme
Mol. Mass.:41344.94
Organism:Homo sapiens (Human)
Description:P30874
Residue:369
BDBM50059090
NameBDBM50059090
Synonyms:10-(4-Amino-butyl)-19-(2-amino-3-phenyl-propionylamino)-16-benzyl-7-(1-hydroxy-ethyl)-13-(1H-indol-3-ylmethyl)-6,9,12,15,18-pentaoxo-1,2-dithia-5,8,11,14,17-pentaaza-cycloicosane-4-carboxylic acid (2-hydroxy-1-hydroxymethyl-propyl)-amide SMS 201-995 | octreotide
TypeSmall organic molecule
Emp. Form.C49H66N10O10S2
Mol. Mass.1019.239
SMILESCC(O)[C@H](CO)NC(=O)[C@@H]1CSSCC(NC(=O)C(N)Cc2ccccc2)C(=O)N[C@H](Cc2ccccc2)C(=O)N[C@H](Cc2c[nH]c3ccccc23)C(=O)N[C@H](CCCCN)C(=O)N[C@H](C(C)O)C(=O)N1