Reaction Details
TargetSomatostatin receptor type 4
LigandBDBM82464
Substrate/Competitorn/a
Ki 45±n/a nM
CommentsPDSP_3364
Citation Patel, YC Somatostatin and its receptor family. Front Neuroendocrinol20:157-98 (1999) 
 
Somatostatin receptor type 4
Name:Somatostatin receptor type 4
Type:Enzyme
Mol. Mass.:42015.38
Organism:Homo sapiens (Human)
Description:P31391
Residue:388
BDBM82464
NameBDBM82464
Synonyms:CAS_71306 RC 160 | Vapreotide
TypeSmall organic molecule
Emp. Form.C57H70N12O9S2
Mol. Mass.1131.371
SMILESCC(C)C1NC(=O)C(CCCCN)NC(=O)C(Cc2c[nH]c3ccccc23)NC(=O)C(Cc2ccc(O)cc2)NC(=O)C(CSSCC(NC1=O)C(=O)NC(Cc1c[nH]c2ccccc12)C(N)=O)NC(=O)C(N)Cc1ccccc1