Reaction Details
TargetSomatostatin receptor type 5
LigandBDBM50232821
Substrate/Competitorn/a
Ki 0.4±n/a nM
CommentsPDSP_3372
Citation Patel, YC Somatostatin and its receptor family. Front Neuroendocrinol20:157-98 (1999) 
 
Somatostatin receptor type 5
Name:Somatostatin receptor type 5
Type:Enzyme
Mol. Mass.:39218.02
Organism:Homo sapiens (Human)
Description:P35346
Residue:364
BDBM50232821
NameBDBM50232821
Synonyms:(S)-((S)-2-aminopropyl) 6-amino-2-(2-(2-(naphthalen-2-yl)-1H-benzo[g]indol-3-yl)acetamido)hexanoate L-817,818
TypeSmall organic molecule
Emp. Form.C33H36N4O3
Mol. Mass.536.6639
SMILESC[C@H](N)COC(=O)[C@H](CCCCN)NC(=O)Cc1c([nH]c2c1ccc1ccccc21)-c1ccc2ccccc2c1