Reaction Details
Target5-hydroxytryptamine receptor 3A
LigandBDBM50249134
Substrate/Competitorn/a
Ki 1000±n/a nM
CommentsPDSP_3873
Citation Bonhaus, DWFlippin, LAGreenhouse, RJJaime, SRocha, CDawson, MVan Natta, KChang, LKPulido-Rios, TWebber, ALeung, EEglen, RMMartin, GR RS-127445: a selective, high affinity, orally bioavailable 5-HT2B receptor antagonist. Br J Pharmacol127:1075-82 (1999) 
 
5-hydroxytryptamine receptor 3A
Name:5-hydroxytryptamine receptor 3A
Type:Protein
Mol. Mass.:55283.27
Organism:Homo sapiens (Human)
Description:P46098
Residue:478
BDBM50249134
NameBDBM50249134
Synonyms:4-(4-fluoronaphthalen-1-yl)-6-isopropylpyrimidin-2-amine RS-127445
TypeSmall organic molecule
Emp. Form.C17H16FN3
Mol. Mass.281.3274
SMILESCC(C)c1cc(nc(N)n1)-c1ccc(F)c2ccccc12