Reaction Details
TargetMelatonin receptor type 1B
LigandBDBM29611
Substrate/Competitorn/a
Ki 0.05±n/a nM
CommentsPDSP_1192
Citation Nonno, RPannacci, MLucini, VAngeloni, DFraschini, FStankov, BM Ligand efficacy and potency at recombinant human MT2 melatonin receptors: evidence for agonist activity of some mt1-antagonists. Br J Pharmacol127:1288-94 (1999) 
 
Melatonin receptor type 1B
Name:Melatonin receptor type 1B
Type:Enzyme
Mol. Mass.:40203.54
Organism:Homo sapiens (Human)
Description:P49286
Residue:362
BDBM29611
NameBDBM29611
Synonyms:2-Iodomelatonin Melatonin,2-Iodo
TypeSmall organic molecule
Emp. Form.C13H15IN2O2
Mol. Mass.358.1749
SMILESCOc1ccc2[nH]c(I)c(CCNC(C)=O)c2c1