Reaction Details
TargetMelatonin receptor type 1B
LigandBDBM50043289
Substrate/Competitorn/a
Ki 0.23±n/a nM
CommentsPDSP_1195
Citation Nonno, RPannacci, MLucini, VAngeloni, DFraschini, FStankov, BM Ligand efficacy and potency at recombinant human MT2 melatonin receptors: evidence for agonist activity of some mt1-antagonists. Br J Pharmacol127:1288-94 (1999) 
 
Melatonin receptor type 1B
Name:Melatonin receptor type 1B
Type:Enzyme
Mol. Mass.:40203.54
Organism:Homo sapiens (Human)
Description:P49286
Residue:362
BDBM50043289
NameBDBM50043289
Synonyms:CHEMBL34730 N-[2-(6-Chloro-5-methoxy-1H-indol-3-yl)-ethyl]-acetamide(6-Chloromelatonin) | melatonin, 6-Chloro
TypeSmall organic molecule
Emp. Form.C13H15ClN2O2
Mol. Mass.266.723
SMILESCOc1cc2c(CCNC(C)=O)c[nH]c2cc1Cl