Reaction Details
TargetSomatostatin receptor type 4
LigandBDBM275947
Substrate/Competitorn/a
Meas. Tech.cAMP Assay
pH7.4±n/a
Temperature298.15±n/a K
EC50 1.30±n/a nM
Commentsextracted
Citation Mazzaferro, RFerrara, MGiovannini, RLingard, IRudolf, K Morpholine and 1,4-oxazepane amides as somatostatin receptor subtype 4 (SSTR4) agonists US Patent US10071974 Publication Date 9/11/2018
 
Somatostatin receptor type 4
Name:Somatostatin receptor type 4
Type:Enzyme
Mol. Mass.:42015.38
Organism:Homo sapiens (Human)
Description:P31391
Residue:388
BDBM275947
NameBDBM275947
Synonyms:US10071974, Example 58 US10071974, Example 60 | US10577336, Example 60
TypeSmall organic molecule
Emp. Form.C17H24N4O2
Mol. Mass.316.3981
SMILESCc1cccc2c(n[nH]c12)C(C)(C)NC(=O)C1CNCCOC1