Reaction Details
TargetSomatostatin receptor type 4
LigandBDBM275984
Substrate/Competitorn/a
Meas. Tech.Radioligand Binding Assays
Temperature298.15±n/a K
Ki 218±n/a nM
Commentsextracted
Citation Mazzaferro, RFerrara, MGiovannini, RLingard, IRudolf, K Morpholine and 1,4-oxazepane amides as somatostatin receptor subtype 4 (SSTR4) agonists US Patent US10071974 Publication Date 9/11/2018
 
Somatostatin receptor type 4
Name:Somatostatin receptor type 4
Type:Enzyme
Mol. Mass.:42015.38
Organism:Homo sapiens (Human)
Description:P31391
Residue:388
BDBM275984
NameBDBM275984
Synonyms:US10071974, Example 95 | US10577336, Example 95
TypeSmall organic molecule
Emp. Form.C16H22N4O2
Mol. Mass.302.3715
SMILESCc1cccn2c(ncc12)C(C)(C)NC(=O)[C@@H]1CNCCO1