Reaction Details
TargetAdenosine receptor A2a
LigandBDBM50041905
Substrate/Competitorn/a
Ki 3.1±n/a nM
CommentsPDSP_2453
Citation Klotz, KNCamaioni, EVolpini, RKachler, SVittori, SCristalli, G 2-Substituted N-ethylcarboxamidoadenosine derivatives as high-affinity agonists at human A3 adenosine receptors. Naunyn Schmiedebergs Arch Pharmacol360:103-8 (1999) 
 
Adenosine receptor A2a
Name:Adenosine receptor A2a
Type:G Protein-Coupled Receptor (GPCR)
Mol. Mass.:44716.46
Organism:Homo sapiens (Human)
Description:P29274
Residue:412
BDBM50041905
NameBDBM50041905
Synonyms:5-[6-Amino-2-(3-hydroxy-3-phenyl-prop-1-ynyl)-purin-9-yl]-3,4-dihydroxy-tetrahydro-furan-2-carboxylic acid ethylamide 6, PHPNECA | R,S-PHPNECA
TypeSmall organic molecule
Emp. Form.C21H22N6O5
Mol. Mass.438.4366
SMILESCCNC(=O)C1OC(C(O)C1O)n1cnc2c(N)nc(nc12)C#CC(O)c1ccccc1